{"text_format":"1","workbook":"xlsx","n_sheets":4,"sheets":["Congreso","Senado","MAPAS","Hoja3"],"not_rendered":{"charts":2,"images":1,"macros":1,"external_links":0,"defined_names":0,"comments":0,"pivot_tables":0},"unopened":[],"bounds":{"document_bytes":16777216,"sheet_cells":100000,"rows_first":2000,"rows_last":500,"rows_between":2000,"halvings":0,"cell_chars":16384,"cell_head_chars":4096},"cells_cut":0,"cells_raw":0,"read":"whole","date_system":"1900"}

{"sheet":"Congreso","index":0,"n_rows":608,"n_cols":35,"rows_kept":608,"cut":false,"hidden":false,"merged":[[4,23,6,23],[4,27,4,32],[4,18,6,18],[5,13,5,14],[4,3,4,15],[4,21,6,21],[4,19,6,19],[4,22,6,22],[4,20,6,20],[5,3,5,4],[5,5,5,6],[5,7,5,8],[5,9,5,10],[5,11,5,12],[4,24,6,24]]}
[]
[null,null,"v3.0",null,null,null,null,null,null,null,null,null,null,"Calculadora de circunscripciones electorales españolas",null,null,null,null,null,null,null,null,"CONGRESO"]
[null,null,null,null,null,null,null,null,null,null,"www.Electomania.es",null,null,null,null,"Hecho por Lutxana "]
[null,null,null,null,null,null,null,null,null,null,null,null,null,null,null,"Mejorado por Johnniezq"]
[null,null,null,"Extrapolación por circunscripciones",null,null,null,null,null,null,null,null,null,null,null,null,null,null,"PARTIDO","20D %","20D escaños","Previsión %","Cociente","Previsión escaños","Dif.",null,null,"20D"]
[null,"ESC.","CIRCUNSCRIPCIÓN","PP",null,"PSOE",null,"UP",null,"C's",null,"Terr1",null,"Terr2",null,null,null,null,null,null,null,null,null,null,null,null,null,"PP","PSOE","UP","C's","Terr1","Terr2"]
[null,8,"A Coruña",{"$f":"AB7*W$8","v":0.35465285515320327},{"$f":"D71","v":3},{"$f":"AC7*W$9","v":0.20142253521126763},{"$f":"F71","v":2},{"$f":"AD7*W10","v":0.25951573355128726},{"$f":"H71","v":2},{"$f":"AE7*W$14","v":0.10528930366116293},{"$f":"J71","v":1},{"$f":"AF7*W$19","v":4.5499999999999999E-2},{"$f":"L71","v":0},null,null,"NÓS",null,null,null,null,null,null,null,null,null,null,null,0.35489999999999999,0.20430000000000001,0.26350000000000001,9.9099999999999994E-2,4.5499999999999999E-2,null,"NÓS"]
[null,4,"Albacete",0.36824338440111415,{"$f":"D79","v":2},0.27763380281690142,{"$f":"F79","v":1},{"$f":"AD8*W$10","v":0.17658888434818143},{"$f":"H79","v":1},0.15479971284996408,{"$f":"J79","v":0},null,null,null,null,null,null,null,"PP",0.28720000000000001,123,0.28699999999999998,{"$f":"V8/T8","v":0.99930362116991633},{"$f":"E59","v":115},{"$f":"X8-U8","v":-8},null,null,0.36849999999999999,0.28160000000000002,0.17929999999999999,0.1457]
[null,12,"Alicante / Alacant",0.32827123955431753,{"$f":"D95","v":4},0.20566197183098592,{"$f":"F95","v":3},0.25537923988557415,{"$f":"H95","v":3},0.18114860014357501,{"$f":"J95","v":2},null,null,null,null,null,null,null,"PSOE",0.22009999999999999,90,0.217,{"$f":"V9/T9","v":0.9859154929577465},{"$f":"G59","v":84},{"$f":"X9-U9","v":-6},null,null,0.32850000000000001,0.20860000000000001,0.25929999999999997,0.17050000000000001]
[null,6,"Almería",0.3801350974930362,{"$f":"D105","v":2},0.2843380281690141,{"$f":"F105","v":2},0.1603383735185942,{"$f":"H105","v":1},0.15256855707106962,{"$f":"J105","v":1},null,null,null,null,null,null,null,"UP",0.2447,44,0.24099999999999999,{"$f":"V10/T10","v":0.98487944421740903},{"$f":"SUM(Z10:Z13)","v":86},{"$f":"X10-U10-U11-U12-U13","v":15},{"$f":"I59-Z11-Z12-Z13","v":59},null,0.38040000000000002,0.28839999999999999,0.1628,0.14360000000000001]
[null,4,"Araba - Álava",0.18786908077994427,{"$f":"D113","v":1},0.13950704225352112,{"$f":"F113","v":0},0.303342868818962,{"$f":"H113","v":2},6.2259870782483837E-2,{"$f":"J113","v":0},{"$f":"AF11*W$16","v":0.15472932330827069},{"$f":"L113","v":1},{"$f":"AG11*W$17","v":0.12258620689655172},{"$f":"N113","v":0},"PNV","BILDU",null,"En Comú Podem",null,12,null,null,null,{"$f":"Z11-U11","v":0},{"$f":"I15+I27+I37+I52","v":12},null,0.188,0.14149999999999999,0.308,5.8599999999999999E-2,0.1583,0.11849999999999999,"PNV","BILDU"]
[null,8,"Asturias",0.30129004178272978,{"$f":"D125","v":3},0.2294225352112676,{"$f":"F125","v":2},0.29329709848794444,{"$f":"H125","v":2},0.14406891600861446,{"$f":"J125","v":1},null,null,null,null,null,null,null,"A la Valenciana",null,9,null,null,null,{"$f":"Z12-U12","v":0},{"$f":"I9+I21+I55","v":9},null,0.30149999999999999,0.23269999999999999,0.29780000000000001,0.1356]
[null,3,"Ávila",0.4620779944289693,{"$f":"D132","v":2},0.19540845070422536,{"$f":"F132","v":1},0.15265631385369841,{"$f":"H132","v":0},0.16627422828427851,{"$f":"J132","v":0},null,null,null,null,null,null,null,"En Marea",null,6,null,null,null,{"$f":"Z13-U13","v":0},{"$f":"I7+I38+I44+I46","v":6},null,0.46239999999999998,0.19819999999999999,0.155,0.1565]
[null,6,"Badajoz",0.3446598189415041,{"$f":"D142","v":2},0.36685915492957744,{"$f":"F142","v":3},0.14694401307723742,{"$f":"H142","v":1},0.12058865757358218,{"$f":"J142","v":0},null,null,null,null,null,null,null,"C´s",0.13930000000000001,40,0.14799999999999999,{"$f":"V14/T14","v":1.0624551328068914},{"$f":"K59","v":39},-1,null,null,0.34489999999999998,0.37209999999999999,0.1492,0.1135]
[null,31,"Barcelona",0.11262151810584957,{"$f":"D177","v":3},0.16040845070422535,{"$f":"F177","v":5},0.26503105843890479,{"$f":"H177","v":9},0.14396267049533379,{"$f":"J177","v":5},{"$f":"AF15*W$15","v":0.14722222222222223},{"$f":"L177","v":5},{"$f":"AG15*W$18","v":0.13934728033472804},{"$f":"N177","v":4},"DiL","ERC",null,"DiL",2.2499999999999999E-2,8,2.5000000000000001E-2,1.1111111111111112,{"$f":"M15+M27+M37+M52","v":10},2,null,null,0.11269999999999999,0.16270000000000001,0.26910000000000001,0.13550000000000001,0.13250000000000001,0.14480000000000001,"DiL","ERC"]
{"$rows_left_out":594}
{"sheet":"Senado","index":1,"n_rows":501,"n_cols":46,"rows_kept":501,"cut":false,"hidden":false,"merged":[[5,22,6,22],[5,23,6,23],[4,3,4,15],[4,27,4,33],[5,3,5,4],[5,5,5,6],[5,7,5,8],[5,9,5,10],[5,11,5,12],[5,13,5,14],[5,15,5,16],[5,21,6,21]]}
[]
[null,null,"v1.0",null,null,null,null,null,null,null,null,null,null,"Calculadora de circunscripciones electorales españolas",null,null,null,null,null,null,null,null,"SENADO"]
[null,null,null,null,null,null,null,null,null,null,"www.Electomania.es",null,null,null,null,"Lutxana"]
[]
[null,null,null,"Extrapolación por circunscripciones",null,null,null,null,null,null,null,null,null,null,null,null,null,null,null,null,null,null,null,null,null,null,null,"20D"]
[null,null,null,"PP",null,"PSOE",null,"UP",null,"C´s",null,null,null,"Terr1",null,"Terr2",null,null,null,null,null,"20D","Introducir datos encuesta","Cociente","Electos",null,null,"PP","PSOE","UP","Cs","IU","Nac1","Nac2",null,null,null,null,{"$f":"C7","v":"A Coruña"},"PP","PSOE","UP","C´s","Equo","BNG"]
[null,8,"A Coruña",{"$f":"AB7*X$8","v":0.35465285515320327},{"$f":"AN16","v":3},{"$f":"AC7*X$9","v":0.20142253521126763},{"$f":"AO16","v":0},{"$f":"AD7*X10","v":0.25951573355128726},{"$f":"AP16","v":1},{"$f":"AE7*X$11","v":0.10528930366116293},{"$f":"AQ16","v":0},null,null,0,{"$f":"AS16","v":0},null,null,"BNG",null,null,null,null,null,null,"Electos","Designados","Total",0.35489999999999999,0.20430000000000001,0.26350000000000001,9.9099999999999994E-2,0,4.5499999999999999E-2,null,"BNG",null,null,{"$f":"LARGE(AN8:AR8,2)","v":25.951573355128726},{"$f":"LARGE(AN8:AR8,1)","v":35.465285515320325},{"$f":"$D7","v":0.35465285515320327},{"$f":"$F7","v":0.20142253521126763},{"$f":"$H7","v":0.25951573355128726},{"$f":"$J7","v":0.10528930366116293},{"$f":"$L7","v":0},{"$f":"$N7","v":0}]
[null,4,"Albacete",0.36824338440111415,{"$f":"AN25","v":3},0.27763380281690142,{"$f":"AO25","v":1},{"$f":"AD8*X$10","v":0.17658888434818143},{"$f":"AP25","v":0},0.15479971284996408,{"$f":"AQ25","v":0},null,null,null,null,null,null,null,null,null,"PP",0.28720000000000001,{"$f":"Congreso!V8","v":0.28699999999999998},{"$f":"W8/V8","v":0.99930362116991633},{"$f":"E59","v":117},21,{"$f":"Y8+Z8","v":138},0.36849999999999999,0.28160000000000002,0.17929999999999999,0.1457,0,null,null,null,null,null,null,1,{"$f":"AN7*100","v":35.465285515320325},20.142253521126761,25.951573355128726,10.528930366116294,0,0]
[null,12,"Alicante / Alacant",0.32847110027855148,{"$f":"AN41","v":3},0.20566197183098592,{"$f":"AO41","v":0},0.25537923988557415,{"$f":"AP41","v":1},0.18114860014357501,{"$f":"AQ41","v":0},null,null,null,{"$f":"AS41","v":0},{"$f":"AH9*X$15","v":0},{"$f":"AT41","v":0},"Comp","ERC",null,"PSOE",0.22009999999999999,{"$f":"Congreso!V9","v":0.217},{"$f":"W9/V9","v":0.9859154929577465},{"$f":"G59","v":41},20,{"$f":"Y9+Z9","v":61},0.32869999999999999,0.20860000000000001,0.25929999999999997,0.17050000000000001,0,0,0,"Comp","ERC",null,null,2,{"$f":"AN$8/$AM9","v":17.732642757660162},10.071126760563381,12.975786677564363,5.2644651830581468,0,0]
[null,6,"Almería",0.3801350974930362,{"$f":"AN51","v":3},0.2843380281690141,{"$f":"AO51","v":1},0.1603383735185942,{"$f":"AP51","v":0},0.15256855707106962,{"$f":"AQ51","v":0},null,null,null,{"$f":"AS51","v":0},null,null,"PA",null,null,"Podemos",0.2447,{"$f":"Congreso!V10","v":0.24099999999999999},{"$f":"W10/V10","v":0.98487944421740903},{"$f":"I59","v":37},7,44,0.38040000000000002,0.28839999999999999,0.1628,0.14360000000000001,0,0,null,"PA",null,null,null,3,11.821761838440109,6.7140845070422541,8.6505244517095754,3.5096434553720979,0,0]
[null,4,"Araba - Álava",0.18786908077994427,{"$f":"AN59","v":1},0.13950704225352112,{"$f":"AO59","v":0},0.303342868818962,{"$f":"AP59","v":3},6.2259870782483837E-2,{"$f":"AQ59","v":0},null,null,{"$f":"AG11*X$13","v":0.15472932330827069},{"$f":"AS59","v":0},{"$f":"AH11*X$14","v":0.12258620689655172},{"$f":"AT59","v":0},"PNV","Bildu",null,"C´s",0.13930000000000001,{"$f":"Congreso!V14","v":0.14799999999999999},{"$f":"W11/V11","v":1.0624551328068914},{"$f":"K59","v":0},3,3,0.188,0.14149999999999999,0.308,5.8599999999999999E-2,0,0.1583,0.11849999999999999,"PNV","Amaiur",null,null,4,8.8663213788300812,5.0355633802816904,6.4878933387821816,2.6322325915290734,0,0]
[null,8,"Asturias",0.30129004178272978,{"$f":"AN71","v":3},0.2294225352112676,{"$f":"AO71","v":0},0.29329709848794444,{"$f":"AP71","v":1},0.14406891600861446,{"$f":"AQ71","v":0},null,null,null,{"$f":"AS71","v":0},null,null,"FAC",null,null,"DiL",2.2499999999999999E-2,{"$f":"Congreso!V15","v":2.5000000000000001E-2},{"$f":"W12/V12","v":1.1111111111111112},{"$f":"O15+O27+O37+O52","v":7},2,9,0.30149999999999999,0.23269999999999999,0.29780000000000001,0.1356,0,0,null,"FAC",null,null,null,5,7.0930571030640648,4.0284507042253521,5.1903146710257451,2.1057860732232587,0,0]
[null,3,"Ávila",0.4620779944289693,{"$f":"AN78","v":3},0.19540845070422536,{"$f":"AO78","v":1},0.15265631385369841,{"$f":"AP78","v":0},0.16627422828427851,{"$f":"AQ78","v":0},null,null,null,null,null,null,null,null,null,"PNV",1.3299999999999999E-2,{"$f":"Congreso!V16","v":1.2999999999999999E-2},0.97744360902255645,{"$f":"O11+O26+O16","v":2},1,3,0.46239999999999998,0.19819999999999999,0.155,0.1565,0,null,null,null,null,null,null,6,5.9108809192200544,3.3570422535211271,4.3252622258547877,1.7548217276860489,0,0]
[null,6,"Badajoz",0.3446598189415041,{"$f":"AN88","v":1},0.36685915492957744,{"$f":"AO88","v":3},0.14694401307723742,{"$f":"AP88","v":0},0.12058865757358218,{"$f":"AQ88","v":0},null,null,null,null,null,null,null,null,null,"Bildu",8.6999999999999994E-3,{"$f":"Congreso!V17","v":8.9999999999999993E-3},1.0344827586206897,{"$f":"Q16+Q26+Q11+Q43","v":0},1,1,0.34489999999999998,0.37209999999999999,0.1492,0.1135,0,null,null,null,null,null,null,7,5.0664693593314754,2.8774647887323943,3.7073676221612466,1.5041329094451847,0,0]
[null,31,"Barcelona",0.11262151810584957,{"$f":"AN123","v":0},0.16040845070422535,{"$f":"AO123","v":1},0.26503105843890479,{"$f":"AP123","v":3},0.14396267049533379,{"$f":"AQ123","v":0},null,null,{"$f":"AG15*X$12","v":0.14722222222222223},{"$f":"AS123","v":0},{"$f":"AH15*X$15","v":0.13934728033472804},{"$f":"AT123","v":0},"DiL","ERC",null,"ERC",2.3900000000000001E-2,{"$f":"Congreso!V18","v":2.3E-2},0.96234309623430958,{"$f":"Q15+Q27+Q9+Q21+Q32+Q55+Q37+Q52","v":2},2,4,0.11269999999999999,0.16270000000000001,0.26910000000000001,0.13550000000000001,null,0.13250000000000001,0.14480000000000001,"CiU","ERC",null,null,8,4.4331606894150406,2.5177816901408452,3.2439466693910908,1.3161162957645367,0,0]
{"$rows_left_out":487}
{"sheet":"MAPAS","index":2,"n_rows":55,"n_cols":21,"rows_kept":55,"cut":false,"hidden":false,"merged":[]}
[null,null,null,null,"26J"]
[null,null,null,null,null,null,null,null,null,null,null,null,null,null,"¡¡CAMBIAD EL NÚMERO DE LA HOJA 3 PARA VER BIEN LOS COLORES!!!!",null,null,null,null,null,"AQUÍ"]
[null,null,null,null,null,null,null,null,null,null,"Provincia",null,"Color",null,"LUEGO DAD AL BOTÓN DE \"ACTUALIZAR COLORES\""]
[null,null,null,null,null,null,null,null,null,null,"Álava","alava",{"$f":"VLOOKUP(K4,Hoja3!$AD$4:$AE$55,2,FALSE)","v":20}]
[null,null,null,null,null,null,null,null,null,null,"Albacete","albacete",{"$f":"VLOOKUP(K5,Hoja3!$AD$4:$AE$55,2,FALSE)","v":48}]
[null,null,null,null,null,null,null,null,null,null,"Alicante","alicante",{"$f":"VLOOKUP(K6,Hoja3!$AD$4:$AE$55,2,FALSE)","v":48},null,null,null,"20D"]
[null,null,null,null,null,null,null,null,null,null,"Almería","almeria",{"$f":"VLOOKUP(K7,Hoja3!$AD$4:$AE$55,2,FALSE)","v":48}]
[null,null,null,null,null,null,null,null,null,null,"Asturias","asturias",{"$f":"VLOOKUP(K8,Hoja3!$AD$4:$AE$55,2,FALSE)","v":48}]
[null,null,null,null,null,null,null,null,null,null,"Ávila","avila",{"$f":"VLOOKUP(K9,Hoja3!$AD$4:$AE$55,2,FALSE)","v":48}]
[null,null,null,null,null,null,null,null,null,null,"Badajoz","badajoz",{"$f":"VLOOKUP(K10,Hoja3!$AD$4:$AE$55,2,FALSE)","v":10}]
[null,null,null,null,null,null,null,null,null,null,"Barcelona","barcelona",{"$f":"VLOOKUP(K11,Hoja3!$AD$4:$AE$55,2,FALSE)","v":20}]
[null,null,null,null,null,null,null,null,null,null,"Burgos","burgos",{"$f":"VLOOKUP(K12,Hoja3!$AD$4:$AE$55,2,FALSE)","v":48}]
[null,null,null,null,null,null,null,null,null,null,"Cáceres","caceres",{"$f":"VLOOKUP(K13,Hoja3!$AD$4:$AE$55,2,FALSE)","v":48}]
[null,null,null,null,null,null,null,null,null,null,"Cádiz","cadiz",{"$f":"VLOOKUP(K14,Hoja3!$AD$4:$AE$55,2,FALSE)","v":48}]
[null,null,null,null,null,null,null,null,null,null,"Cantabria","cantabria",{"$f":"VLOOKUP(K15,Hoja3!$AD$4:$AE$55,2,FALSE)","v":48}]
{"$rows_left_out":41}
{"sheet":"Hoja3","index":3,"n_rows":55,"n_cols":31,"rows_kept":55,"cut":false,"hidden":false,"merged":[]}
[null,5,null,null,null,"Cambiar este número por otro mayor que 0"]
[]
["CIRCUNSCRIPCIÓN","PP",null,null,null,"PSOE",null,null,null,"UP",null,null,null,"C's",null,null,null,"Terr1",null,null,null,"Terr2",null,null,null,"MAX","COLOR",null,"Autonom+AD+AC1:AE41","Provincia","color"]
["A Coruña",32.130000000000003,{"$f":"CONT_COL_COND(Hoja3!$B$1,B4)","v":1},48,{"$f":"C4*D4","v":48},{"$f":"Congreso!F7*100","v":20.142253521126761},{"$f":"CONT_COL_COND(Hoja3!$B$1,F4)","v":0},10,{"$f":"G4*H4","v":0},{"$f":"Congreso!H7*100","v":25.951573355128726},{"$f":"CONT_COL_COND(Hoja3!$B$1,J4)","v":0},20,{"$f":"K4*L4","v":0},{"$f":"Congreso!J7*100","v":10.528930366116294},{"$f":"CONT_COL_COND(Hoja3!$B$1,N4)","v":0},52,{"$f":"O4*P4","v":0},{"$f":"Congreso!L7*100","v":4.55},{"$f":"CONT_COL_COND(Hoja3!$B$1,R4)","v":0},55,{"$f":"S4*T4","v":0},{"$f":"Congreso!N7*100","v":0},{"$f":"CONT_COL_COND(Hoja3!$B$1,V4)","v":0},55,{"$f":"W4*X4","v":0},{"$f":"MAX(B4,F4,J4,N4,R4,V4)","v":32.130000000000003},{"$f":"E4+I4+M4+Q4+U4+Y4","v":48},null,"Galicia","La Coruña",{"$f":"AA4","v":48}]
["Albacete",{"$f":"Congreso!D8*100","v":36.824338440111418},{"$f":"CONT_COL_COND(Hoja3!$B$1,B5)","v":1},48,48,{"$f":"Congreso!F8*100","v":27.763380281690143},{"$f":"CONT_COL_COND(Hoja3!$B$1,F5)","v":0},10,0,{"$f":"Congreso!H8*100","v":17.658888434818142},{"$f":"CONT_COL_COND(Hoja3!$B$1,J5)","v":0},20,0,{"$f":"Congreso!J8*100","v":15.479971284996408},{"$f":"CONT_COL_COND(Hoja3!$B$1,N5)","v":0},52,0,{"$f":"Congreso!L8*100","v":0},{"$f":"CONT_COL_COND(Hoja3!$B$1,R5)","v":0},55,0,{"$f":"Congreso!N8*100","v":0},{"$f":"CONT_COL_COND(Hoja3!$B$1,V5)","v":0},55,0,36.824338440111418,48,null,"Castilla-La Mancha","Albacete",48]
["Alicante / Alacant",{"$f":"Congreso!D9*100","v":32.827123955431752},{"$f":"CONT_COL_COND(Hoja3!$B$1,B6)","v":1},48,48,{"$f":"Congreso!F9*100","v":20.566197183098591},{"$f":"CONT_COL_COND(Hoja3!$B$1,F6)","v":0},10,0,{"$f":"Congreso!H9*100","v":25.537923988557417},{"$f":"CONT_COL_COND(Hoja3!$B$1,J6)","v":0},20,0,{"$f":"Congreso!J9*100","v":18.1148600143575},{"$f":"CONT_COL_COND(Hoja3!$B$1,N6)","v":0},52,0,{"$f":"Congreso!L9*100","v":0},{"$f":"CONT_COL_COND(Hoja3!$B$1,R6)","v":0},55,0,{"$f":"Congreso!N9*100","v":0},{"$f":"CONT_COL_COND(Hoja3!$B$1,V6)","v":0},55,0,32.827123955431752,48,null,"Valencia","Alicante",48]
["Almería",{"$f":"Congreso!D10*100","v":38.013509749303623},{"$f":"CONT_COL_COND(Hoja3!$B$1,B7)","v":1},48,48,{"$f":"Congreso!F10*100","v":28.433802816901409},{"$f":"CONT_COL_COND(Hoja3!$B$1,F7)","v":0},10,0,{"$f":"Congreso!H10*100","v":16.033837351859422},{"$f":"CONT_COL_COND(Hoja3!$B$1,J7)","v":0},20,0,{"$f":"Congreso!J10*100","v":15.256855707106961},{"$f":"CONT_COL_COND(Hoja3!$B$1,N7)","v":0},52,0,{"$f":"Congreso!L10*100","v":0},{"$f":"CONT_COL_COND(Hoja3!$B$1,R7)","v":0},55,0,{"$f":"Congreso!N10*100","v":0},{"$f":"CONT_COL_COND(Hoja3!$B$1,V7)","v":0},55,0,38.013509749303623,48,null,"Andalucía","Almería",48]
["Araba - Álava",{"$f":"Congreso!D11*100","v":18.786908077994426},{"$f":"CONT_COL_COND(Hoja3!$B$1,B8)","v":0},48,0,{"$f":"Congreso!F11*100","v":13.950704225352112},{"$f":"CONT_COL_COND(Hoja3!$B$1,F8)","v":0},10,0,{"$f":"Congreso!H11*100","v":30.334286881896201},{"$f":"CONT_COL_COND(Hoja3!$B$1,J8)","v":1},20,20,{"$f":"Congreso!J11*100","v":6.2259870782483837},{"$f":"CONT_COL_COND(Hoja3!$B$1,N8)","v":0},52,0,{"$f":"Congreso!L11*100","v":15.472932330827069},{"$f":"CONT_COL_COND(Hoja3!$B$1,R8)","v":0},55,0,{"$f":"Congreso!N11*100","v":12.258620689655173},{"$f":"CONT_COL_COND(Hoja3!$B$1,V8)","v":0},55,0,30.334286881896201,20,null,"País Vasco","Álava",20]
["Asturias",{"$f":"Congreso!D12*100","v":30.129004178272979},{"$f":"CONT_COL_COND(Hoja3!$B$1,B9)","v":1},48,48,{"$f":"Congreso!F12*100","v":22.942253521126759},{"$f":"CONT_COL_COND(Hoja3!$B$1,F9)","v":0},10,0,{"$f":"Congreso!H12*100","v":29.329709848794444},{"$f":"CONT_COL_COND(Hoja3!$B$1,J9)","v":0},20,0,{"$f":"Congreso!J12*100","v":14.406891600861446},{"$f":"CONT_COL_COND(Hoja3!$B$1,N9)","v":0},52,0,{"$f":"Congreso!L12*100","v":0},{"$f":"CONT_COL_COND(Hoja3!$B$1,R9)","v":0},55,0,{"$f":"Congreso!N12*100","v":0},{"$f":"CONT_COL_COND(Hoja3!$B$1,V9)","v":0},55,0,30.129004178272979,48,null,"Asturias","Asturias",48]
["Ávila",{"$f":"Congreso!D13*100","v":46.207799442896928},{"$f":"CONT_COL_COND(Hoja3!$B$1,B10)","v":1},48,48,{"$f":"Congreso!F13*100","v":19.540845070422534},{"$f":"CONT_COL_COND(Hoja3!$B$1,F10)","v":0},10,0,{"$f":"Congreso!H13*100","v":15.26563138536984},{"$f":"CONT_COL_COND(Hoja3!$B$1,J10)","v":0},20,0,{"$f":"Congreso!J13*100","v":16.62742282842785},{"$f":"CONT_COL_COND(Hoja3!$B$1,N10)","v":0},52,0,{"$f":"Congreso!L13*100","v":0},{"$f":"CONT_COL_COND(Hoja3!$B$1,R10)","v":0},55,0,{"$f":"Congreso!N13*100","v":0},{"$f":"CONT_COL_COND(Hoja3!$B$1,V10)","v":0},55,0,46.207799442896928,48,null,"Castilla y León","Ávila",48]
["Badajoz",{"$f":"Congreso!D14*100","v":34.46598189415041},{"$f":"CONT_COL_COND(Hoja3!$B$1,B11)","v":0},48,0,{"$f":"Congreso!F14*100","v":36.685915492957747},{"$f":"CONT_COL_COND(Hoja3!$B$1,F11)","v":1},10,10,{"$f":"Congreso!H14*100","v":14.694401307723743},{"$f":"CONT_COL_COND(Hoja3!$B$1,J11)","v":0},20,0,{"$f":"Congreso!J14*100","v":12.058865757358218},{"$f":"CONT_COL_COND(Hoja3!$B$1,N11)","v":0},52,0,{"$f":"Congreso!L14*100","v":0},{"$f":"CONT_COL_COND(Hoja3!$B$1,R11)","v":0},55,0,{"$f":"Congreso!N14*100","v":0},{"$f":"CONT_COL_COND(Hoja3!$B$1,V11)","v":0},55,0,36.685915492957747,10,null,"Extremadura","Badajoz",10]
["Barcelona",{"$f":"Congreso!D15*100","v":11.262151810584957},{"$f":"CONT_COL_COND(Hoja3!$B$1,B12)","v":0},48,0,{"$f":"Congreso!F15*100","v":16.040845070422534},{"$f":"CONT_COL_COND(Hoja3!$B$1,F12)","v":0},10,0,{"$f":"Congreso!H15*100","v":26.503105843890477},{"$f":"CONT_COL_COND(Hoja3!$B$1,J12)","v":1},20,20,{"$f":"Congreso!J15*100","v":14.396267049533378},{"$f":"CONT_COL_COND(Hoja3!$B$1,N12)","v":0},52,0,{"$f":"Congreso!L15*100","v":14.722222222222223},{"$f":"CONT_COL_COND(Hoja3!$B$1,R12)","v":0},55,0,{"$f":"Congreso!N15*100","v":13.934728033472805},{"$f":"CONT_COL_COND(Hoja3!$B$1,V12)","v":0},55,0,26.503105843890477,20,null,"Cataluña","Barcelona",20]
["Bizkaia",{"$f":"Congreso!D16*100","v":11.372075208913648},{"$f":"CONT_COL_COND(Hoja3!$B$1,B13)","v":0},48,0,{"$f":"Congreso!F16*100","v":12.787323943661974},{"$f":"CONT_COL_COND(Hoja3!$B$1,F13)","v":0},10,0,{"$f":"Congreso!H16*100","v":28.482713526767473},{"$f":"CONT_COL_COND(Hoja3!$B$1,J13)","v":1},20,20,{"$f":"Congreso!J16*100","v":4.0692031586503941},{"$f":"CONT_COL_COND(Hoja3!$B$1,N13)","v":0},52,0,{"$f":"Congreso!L16*100","v":27.3},{"$f":"CONT_COL_COND(Hoja3!$B$1,R13)","v":0},55,0,{"$f":"Congreso!N16*100","v":12.931034482758621},{"$f":"CONT_COL_COND(Hoja3!$B$1,V13)","v":0},55,0,28.482713526767473,20,null,"País Vasco","Vizcaya",20]
["Burgos",{"$f":"Congreso!D17*100","v":38.053481894150416},{"$f":"CONT_COL_COND(Hoja3!$B$1,B14)","v":1},48,48,{"$f":"Congreso!F17*100","v":20.418309859154931},{"$f":"CONT_COL_COND(Hoja3!$B$1,F14)","v":0},10,0,{"$f":"Congreso!H17*100","v":21.421127911728647},{"$f":"CONT_COL_COND(Hoja3!$B$1,J14)","v":0},20,0,{"$f":"Congreso!J17*100","v":16.510552763819096},{"$f":"CONT_COL_COND(Hoja3!$B$1,N14)","v":0},52,0,{"$f":"Congreso!L17*100","v":0},{"$f":"CONT_COL_COND(Hoja3!$B$1,R14)","v":0},55,0,{"$f":"Congreso!N17*100","v":0},{"$f":"CONT_COL_COND(Hoja3!$B$1,V14)","v":0},55,0,38.053481894150416,48,null,"Castilla y León","Burgos",48]
["Cáceres",{"$f":"Congreso!D18*100","v":35.325383008356539},{"$f":"CONT_COL_COND(Hoja3!$B$1,B15)","v":1},48,48,{"$f":"Congreso!F18*100","v":33.580281690140843},{"$f":"CONT_COL_COND(Hoja3!$B$1,F15)","v":0},10,0,{"$f":"Congreso!H18*100","v":16.575521046178995},{"$f":"CONT_COL_COND(Hoja3!$B$1,J15)","v":0},20,0,{"$f":"Congreso!J18*100","v":12.111988513998563},{"$f":"CONT_COL_COND(Hoja3!$B$1,N15)","v":0},52,0,{"$f":"Congreso!L18*100","v":0},{"$f":"CONT_COL_COND(Hoja3!$B$1,R15)","v":0},55,0,{"$f":"Congreso!N18*100","v":0},{"$f":"CONT_COL_COND(Hoja3!$B$1,V15)","v":0},55,0,35.325383008356539,48,null,"Extremadura","Cáceres",48]
{"$rows_left_out":40}